{"text_format":"1","workbook":"xlsx","n_sheets":11,"sheets":["Druck-Layout","Nachweise","Ergebnisse aus Statik ","Gamma-Verfahren_nach_DIN1052","Weitere Verfahren","Massenschwerpunkt","Verbindungsmittel","Kombinationsbeiwerte_Ψ","Modifikationsbeiwert Kmod ","Werkstoffkenngrößen","Statisches_System"],"not_rendered":{"charts":5,"images":15,"macros":1,"external_links":0,"defined_names":9,"comments":1,"pivot_tables":0},"unopened":[],"bounds":{"document_bytes":16777216,"sheet_cells":100000,"rows_first":2000,"rows_last":500,"rows_between":2000,"halvings":0,"cell_chars":16384,"cell_head_chars":4096},"cells_cut":0,"cells_raw":0,"read":"whole","date_system":"1900"}

{"sheet":"Druck-Layout","index":0,"n_rows":342,"n_cols":9,"rows_kept":342,"cut":false,"hidden":false,"merged":[[266,0,266,1],[276,0,276,1],[312,2,312,3],[312,4,312,5],[264,0,264,6],[221,2,221,3],[221,4,221,5],[223,0,223,1],[223,2,223,3],[223,4,223,5],[221,0,221,1],[219,0,219,1],[219,2,219,3],[219,4,219,5],[220,0,220,1],[220,2,220,3],[220,4,220,5],[215,4,215,5],[213,4,213,5],[212,4,212,5],[211,4,211,5],[215,2,215,3],[213,2,213,3],[212,2,212,3],[211,2,211,3],[211,0,211,1],[215,0,215,1],[212,0,212,1],[183,3,183,4],[183,5,183,6],[184,3,184,4],[184,5,184,6],[185,3,185,4],[185,5,185,6],[213,0,213,1],[173,3,173,4],[173,5,173,6],[174,3,174,4],[174,5,174,6],[181,0,181,2],[181,3,181,4],[181,5,181,6],[170,0,170,2],[170,3,170,4],[170,5,170,6],[172,3,172,4],[172,5,172,6],[166,3,166,4],[166,5,166,6],[167,3,167,4],[167,5,167,6],[168,3,168,4],[168,5,168,6],[159,3,159,4],[159,5,159,6],[161,0,161,2],[161,3,161,6],[164,0,164,2],[164,3,164,4],[164,5,164,6],[155,5,155,6],[156,0,156,2],[156,3,156,4],[156,5,156,6],[158,3,158,4],[158,5,158,6],[152,0,152,2],[153,0,153,2],[154,0,154,2],[155,0,155,2],[155,3,155,4],[135,3,135,4],[135,5,135,6],[136,3,136,4],[136,5,136,6],[151,0,151,2],[132,0,132,2],[132,3,132,4],[132,5,132,6],[134,3,134,4],[134,5,134,6],[0,0,3,6],[8,0,10,6],[12,2,13,4],[330,0,330,2],[268,2,268,3],[268,4,268,5],[266,4,266,5],[266,2,266,3],[244,0,245,6],[18,0,20,6],[21,0,23,6],[27,1,28,5],[31,1,31,4],[32,1,32,4],[33,1,33,4],[34,1,34,4],[35,1,35,4],[36,1,36,4],[75,0,75,2],[73,0,73,2],[74,0,74,2],[78,0,78,2],[15,2,15,4],[70,3,70,5],[331,0,331,2],[293,0,294,6],[279,2,279,3],[278,2,278,3],[276,2,276,3],[276,4,276,5],[278,4,278,5],[279,4,279,5],[269,2,269,3],[269,4,269,5],[319,4,319,5],[319,2,319,3],[312,0,312,1],[319,0,319,1],[328,0,328,1],[274,0,274,6],[49,0,50,6],[54,0,64,3],[52,0,52,2],[52,3,52,6],[66,0,66,2],[67,0,67,2],[68,0,68,2],[69,0,69,2],[70,0,70,2],[79,0,79,2],[82,0,82,2],[82,3,82,4],[76,0,76,2],[77,0,77,2],[82,5,82,6],[83,0,83,2],[83,3,83,4],[83,5,83,6],[84,0,84,2],[84,3,84,4],[84,5,84,6],[86,0,86,2],[86,3,86,4],[86,5,86,6],[85,0,85,2],[85,3,85,4],[85,5,85,6],[87,0,87,2],[87,3,87,4],[87,5,87,6],[88,0,88,2],[88,3,88,4],[88,5,88,6],[106,3,106,4],[106,5,106,6],[195,0,196,6],[147,0,148,6],[98,0,99,6],[102,0,102,2],[103,0,103,2],[104,0,104,2],[105,0,105,2],[106,0,106,2],[123,5,123,6],[124,5,124,6],[125,5,125,6],[125,3,125,4],[124,3,124,4],[123,3,123,4],[107,0,107,2],[107,3,107,4],[107,5,107,6],[109,3,109,4],[110,3,110,4],[110,5,110,6],[109,5,109,6],[112,0,112,2],[112,3,112,6],[115,0,115,2],[115,3,115,4],[115,5,115,6],[121,0,121,2],[121,3,121,4],[121,5,121,6],[119,5,119,6],[118,5,118,6],[117,5,117,6],[119,3,119,4],[118,3,118,4],[117,3,117,4]]}
[]
[]
[]
[]
[]
[]
[]
[]
["Berechnungsprotokoll"]
[]
[]
[]
[null,null,"Bachelorarbeit "]
[]
[]
[null,null,"Fabian Böttinger"]
[]
[]
["Nachgiebiger Verbund - Möglichkeiten der Modellierung"]
[]
{"$rows_left_out":323}
{"sheet":"Nachweise","index":1,"n_rows":173,"n_cols":14,"rows_kept":173,"cut":false,"hidden":false,"merged":[[29,8,29,13],[35,8,35,9],[56,7,58,7],[5,7,7,7],[163,0,164,6],[0,0,1,6],[3,0,3,6],[2,0,2,1],[2,2,2,6],[21,0,21,6],[49,0,50,6],[51,0,51,6],[73,0,73,6],[149,0,149,6],[2,7,2,11],[12,8,13,13],[15,8,15,9],[22,8,22,9]]}
["Nachweise des Holzquerschnittes "]
[]
["Für das: ",null,"Gammaverfahren zum Zeitpunkt t=0",null,null,null,null,"<-- Verfahren Wählen (greift auf \"Ergebnisse aus Statik\" zu)"]
["Nachweis auf Biegung und Zug"]
["Aus Normalkraft: "]
[null,null,null,null,null,null,null,"Holz","Normalkraft",{"$f":"VLOOKUP(C3,'Ergebnisse aus Statik '!B5:H17,2,0)*1000","v":121270},"N"]
[null,"σt,0,d ",null,{"$f":"J6/'Gamma-Verfahren_nach_DIN1052'!F43","v":5.0529166666666665},"[N/mm²]",null,null,null,"Moment",{"$f":"VLOOKUP(C3,'Ergebnisse aus Statik '!B5:H17,3,0)*10^6","v":6010000},"Nmm"]
[null,null,null,null,null,null,null,null,"Querkraft",{"$f":"VLOOKUP(C3,'Ergebnisse aus Statik '!B5:H17,4,0)*1000","v":16800},"N"]
[null,"ft,0,d",null,{"$f":"('Gamma-Verfahren_nach_DIN1052'!E38/1.3)*Werkstoffkenngrößen!G7","v":11.692307692307693},"[N/mm²]"]
[]
[]
["Aus Biegemoment: "]
[null,null,null,null,null,null,null,null,"Schnellübersicht: "]
[null,"σm,0,d ",null,{"$f":"(J7/'Gamma-Verfahren_nach_DIN1052'!G43)*'Gamma-Verfahren_nach_DIN1052'!E43/2","v":7.5124999999999993},"[N/mm²]"]
[]
[null,"ft,0,d",null,{"$f":"('Gamma-Verfahren_nach_DIN1052'!E38/1.3)*Werkstoffkenngrößen!I7","v":18.461538461538463},"[N/mm²]",null,null,null,"Holzquerschnitt"]
[]
["Nachweis: ",null,null,null,null,null,null,null,"Biegung und Zug ",null,null,{"$f":"D20","v":0.83908442982456122},"<",1]
[]
[null,null,null,{"$f":"(D7/D9)+(D14/D16)","v":0.83908442982456122},"< ",1,null,null,"Querkrafttragfähigkeit",null,null,{"$f":"D31","v":0.28437499999999999},"<",1]
{"$rows_left_out":154}
{"sheet":"Ergebnisse aus Statik ","index":2,"n_rows":16,"n_cols":11,"rows_kept":16,"cut":false,"hidden":false,"merged":[[2,2,2,4],[2,5,2,7]]}
[]
[]
[null,null,"HOLZQUERSCHNITT",null,null,"BETONQUERSCHNITT",null,null,"VM "]
[null,null,"Normalkraft [KN]","Moment [KNm]","Querkraft [KN]","Normalkraft [KN]","Moment [KNm]","Querkraft [KN]","FVEd [KN]"]
[null,"Gammaverfahren zum Zeitpunkt t=0",121.27,6.01,16.8,-121.27,2.5369999999999999,4.8375000000000004,8.0760000000000005,null,"t=0"]
[null,"Gammaverfahren zum Zeitpunkt t=∞",116.62,7.12,17.015999999999998,-116.62,2.02,4.6500000000000004,7.7750000000000004,null,"t=unendlich"]
[null,"Schubanalogieverfahren zum Zeitpunkt t=0",137.54,4.2759999999999998,12.01,-137.54,1.804,3.9670000000000001,8.08]
[null,"Schubanalogieverfahren zum Zeitpunkt t=∞",138.30799999999999,4.66,12.33,-138.30799999999999,1.327,3.649,7.78]
[null,"Stabwerkmodellverfahren zum Zeitpunkt t=0",122.6,5.61,12.04,-122.6,2.42,4.87,7.46]
[null,"Stabwerkmodellverfahren zum Zeitpunkt t=∞",137.38,4.28,13.04,-137.38,1.84,4.87,8.59]
[null,"Federmodellverfahren zum Zeitpunkt t=0",123.4,5.54,11.53,-123.4,2.39,4.9400000000000004,7.54]
[null,"Federmodellverfahren zum Zeitpunkt t=∞",114.21,6.38,11.46,-114.21,2.75,4.93,6.74]
[null,"Numerische Verfahren gemäß RFEM zum Zeitpunkt t=0",125.09,5.47,9.92,-125.09,2.44,5.82,7.2]
[null,"Numerische Verfahren gemäß RFEM zum Zeitpunkt t=∞",115.99,6.29,10.18,-115.99,2.8,5.39,6]
[null,"Starrer Verbund zum Zeitpunkt t=0",139.47,4.34,2.98,-139.47,1.83,4.6500000000000004,9.3000000000000007]
[null,"Starrer Verbund zum Zeitpunkt t=∞",140.16999999999999,4.7300000000000004,3,-140.16999999999999,1.35,4.6900000000000004,9.3450000000000006]

{"sheet":"Gamma-Verfahren_nach_DIN1052","index":3,"n_rows":160,"n_cols":19,"rows_kept":160,"cut":false,"hidden":false,"merged":[[111,3,111,6],[93,2,94,10],[102,3,102,6],[101,3,101,6],[99,3,99,6],[98,3,98,6],[96,3,96,6],[96,8,96,10],[99,8,99,10],[98,8,98,10],[102,8,102,10],[101,8,101,10],[110,3,110,6],[111,8,111,10],[110,8,110,10],[81,12,82,21],[48,2,50,10],[48,12,50,21],[127,2,129,10],[53,18,53,21],[54,18,54,21],[55,18,55,21],[56,18,56,21],[57,18,57,21],[63,18,63,21],[64,18,64,21],[65,18,65,21],[70,18,70,21],[71,18,71,21],[72,18,72,21],[77,18,77,21],[60,12,61,21],[67,12,68,21],[58,18,58,20],[51,17,51,21],[70,13,70,16],[71,13,71,16],[72,13,72,16],[77,13,77,16],[74,12,75,21],[51,12,51,16],[63,13,63,16],[64,13,64,16],[65,13,65,16],[57,3,57,6],[57,8,57,10],[57,13,57,16],[53,13,53,16],[54,13,54,16],[55,13,55,16],[56,13,56,16],[58,13,58,16],[58,8,58,10],[63,3,63,6],[53,3,53,6],[54,3,54,6],[55,3,55,6],[51,2,51,5],[56,3,56,6],[58,3,58,6],[60,2,61,10],[51,7,51,10],[63,8,63,10],[8,3,8,4],[21,3,21,5],[2,2,4,11],[159,3,159,4],[159,5,159,6],[157,3,157,4],[157,5,157,6],[157,8,157,9],[158,3,158,4],[158,5,158,6],[142,3,142,6],[143,3,143,6],[144,3,144,6],[152,2,153,10],[154,2,155,10],[146,2,147,10],[150,3,150,6],[149,3,149,6],[150,8,150,10],[149,8,149,10],[9,3,9,4],[9,8,9,11],[10,3,10,4],[10,8,21,11],[11,3,11,4],[12,3,12,4],[13,3,13,4],[17,3,17,5],[18,3,18,5],[19,3,19,5],[20,3,20,5],[24,3,24,5],[25,3,25,5],[56,8,56,10],[55,8,55,10],[54,8,54,10],[53,8,53,10],[77,3,77,6],[77,8,77,10],[64,3,64,6],[64,8,64,10],[65,3,65,6],[65,8,65,10],[67,2,68,10],[70,3,70,6],[70,8,70,10],[71,3,71,6],[71,8,71,10],[72,3,72,6],[72,8,72,10],[74,2,75,10],[116,3,116,6],[117,3,117,6],[104,2,105,10],[107,3,107,6],[107,8,107,10],[109,3,109,6],[109,8,109,10],[113,2,114,10],[159,8,159,9],[158,8,158,9],[144,8,144,10],[143,8,143,10],[142,8,142,10],[139,2,140,10],[137,8,137,10],[137,3,137,6],[136,8,136,10],[117,8,117,10],[116,8,116,10],[130,2,131,10],[132,2,133,10],[135,3,135,6],[135,8,135,10],[136,3,136,6],[78,8,78,10],[78,3,78,6],[91,8,91,10],[79,2,80,10],[82,3,82,6],[82,8,82,10],[83,3,83,6],[83,8,83,10],[84,3,84,6],[84,8,84,10],[86,2,87,10],[89,3,89,6],[89,8,89,10],[90,3,90,6],[90,8,90,10],[91,3,91,6]]}
[]
[]
[null,null,"Gamma-Verfahren nach DIN 1052"]
[]
[]
[]
[]
[null,null,"Schnittgrößen "]
[null,null,"char. Streckenlast    qk [KN/m]",3.75]
[null,null,"max. Moment        Md [KNm]",24.3,null,null,{"$f":"D10*10^6","v":24300000},"Nmm","Querschnittstypen"]
[null,null,"max. Querkraft      Vd [KN]",16.2,null,null,{"$f":"D11*1000","v":16200},"N"]
[null,null,"Statisches System","Einfeldträger"]
[null,null,"Feldlänge [m]",6]
[null,null,"Abstand der Momenten-Nullpunkte [m]",{"$f":"VLOOKUP('Gamma-Verfahren_nach_DIN1052'!D12,Statisches_System!C5:D7,2,0)","v":6}]
[]
[]
[null,null,"Umgebungsbedingungen "]
[null,null,"Nutzungsklasse",1]
[null,null,"Kategorie","Kategorie A: Wohn- und Aufenthaltsräume "]
[null,null,"KLED","mittel"]
{"$rows_left_out":141}
{"sheet":"Weitere Verfahren","index":4,"n_rows":110,"n_cols":15,"rows_kept":110,"cut":false,"hidden":false,"merged":[[94,1,95,8],[86,1,87,8],[89,10,101,16],[3,1,4,8],[47,1,48,8],[50,10,64,15],[84,1,84,8],[74,1,74,2],[73,1,73,2],[81,1,82,8],[7,10,18,16]]}
[]
[]
[null,null,null,null,null,null,null,null,null,null,"EV"]
[null,"Schubanalogieverfahren nach Kreuzinger",null,null,null,null,null,null,null,null,30000]
[]
[]
["GZT ","Ebene A: ",null,"Anfangszustand",null,"Endzustand"]
[null,null,"BA",{"$f":"'Gamma-Verfahren_nach_DIN1052'!D33*'Gamma-Verfahren_nach_DIN1052'!G42+'Gamma-Verfahren_nach_DIN1052'!E33*'Gamma-Verfahren_nach_DIN1052'!G43+'Gamma-Verfahren_nach_DIN1052'!G33*'Gamma-Verfahren_nach_DIN1052'!G44","v":1251250000000},null,{"$f":"'Gamma-Verfahren_nach_DIN1052'!I54*'Gamma-Verfahren_nach_DIN1052'!G42+'Gamma-Verfahren_nach_DIN1052'!I55*'Gamma-Verfahren_nach_DIN1052'!G43+'Gamma-Verfahren_nach_DIN1052'!I56*'Gamma-Verfahren_nach_DIN1052'!G44","v":957905569007.26404},null,"[N/mm²]"]
[null,null,null,{"$f":"D8/10^9","v":1251.25},null,{"$f":"F8/10^9","v":957.90556900726403},null,"[KN/m²]"]
[]
[null,null,"aA",{"$f":"(((D8*12)/K4)^(1/4))/10","v":14.957224783092988},null,{"$f":"(((F8*12)/K4)^(1/4))/10","v":13.990900640636477},null,"[cm]"]
[]
[null,null,"SA","∞",null,"∞"]
[]
[]
["GZG","Ebene A: ",null,"Anfangszustand",null,"Endzustand"]
[null,null,"BA",{"$f":"'Gamma-Verfahren_nach_DIN1052'!D33*'Gamma-Verfahren_nach_DIN1052'!G42+'Gamma-Verfahren_nach_DIN1052'!E33*'Gamma-Verfahren_nach_DIN1052'!G43+'Gamma-Verfahren_nach_DIN1052'!G33*'Gamma-Verfahren_nach_DIN1052'!G44","v":1251250000000},null,{"$f":"'Gamma-Verfahren_nach_DIN1052'!S54*'Gamma-Verfahren_nach_DIN1052'!G42+'Gamma-Verfahren_nach_DIN1052'!S55*'Gamma-Verfahren_nach_DIN1052'!G43+'Gamma-Verfahren_nach_DIN1052'!I56*'Gamma-Verfahren_nach_DIN1052'!G44","v":656071428571.42859},null,"[N/mm²]"]
[null,null,null,{"$f":"D17/10^9","v":1251.25},null,{"$f":"F17/10^9","v":656.07142857142856},null,"[KN/m²]"]
[]
[null,null,"aA",{"$f":"(((D17*12)/K4)^(1/4))/10","v":14.957224783092988},null,{"$f":"(((F17*12)/K4)^(1/4))/10","v":12.727783492216428},null,"[cm]"]
{"$rows_left_out":91}
{"sheet":"Massenschwerpunkt","index":5,"n_rows":27,"n_cols":10,"rows_kept":27,"cut":false,"hidden":true,"merged":[[2,1,3,8]]}
[]
[]
[null,"Massenschwerpunkt des Gesamtquerschnittes "]
[]
[]
[null,"Schwerpunktkoordinaten","Querschnitt 1","m1","Querschnitt 2 ","m2","Querschnitt 3","m3","Verbundquerschnitt"]
[null,"X",0,null,0,null,0,null,{"$f":"(C7*$D$8+E7*$F$8+G7*$H$8)/($D$8+$F$8+$H$8)","v":0}]
[null,"Y",{"$f":"'Gamma-Verfahren_nach_DIN1052'!D45/2","v":312.5},{"$f":"C11*'Gamma-Verfahren_nach_DIN1052'!F42/10^6","v":93.75},{"$f":"'Gamma-Verfahren_nach_DIN1052'!D45/2","v":312.5},{"$f":"E11*'Gamma-Verfahren_nach_DIN1052'!F43/10^6","v":8.4},{"$f":"'Gamma-Verfahren_nach_DIN1052'!D45/2","v":312.5},{"$f":"G11*'Gamma-Verfahren_nach_DIN1052'!F44/10^6","v":0},{"$f":"(C8*$D$8+E8*$F$8+G8*$H$8)/($D$8+$F$8+$H$8)","v":312.5}]
[null,"Z",{"$f":"'Gamma-Verfahren_nach_DIN1052'!E42/2","v":30},null,{"$f":"IF('Gamma-Verfahren_nach_DIN1052'!D25=\"B\",'Gamma-Verfahren_nach_DIN1052'!E43/2,'Gamma-Verfahren_nach_DIN1052'!E42+'Gamma-Verfahren_nach_DIN1052'!E43/2)","v":160},null,{"$f":"IF('Gamma-Verfahren_nach_DIN1052'!D25=\"B\",'Gamma-Verfahren_nach_DIN1052'!E43-'Gamma-Verfahren_nach_DIN1052'!E44/2,'Gamma-Verfahren_nach_DIN1052'!E42+'Gamma-Verfahren_nach_DIN1052'!E43+'Gamma-Verfahren_nach_DIN1052'!E44/2)","v":260},null,{"$f":"(C9*$D$8+E9*$F$8+G9*$H$8)/($D$8+$F$8+$H$8)","v":40.690161527165927}]
[]
[null,"Masse [Kg/m³]",{"$f":"'Gamma-Verfahren_nach_DIN1052'!D32","v":2500},null,{"$f":"'Gamma-Verfahren_nach_DIN1052'!E32","v":350},null,{"$f":"'Gamma-Verfahren_nach_DIN1052'!F32","v":380}]
[]
[null,"Schwerpunktabstände","Querschnitt 1","m1","Querschnitt 2 ","m2","Querschnitt 3","m3","Verbundquerschnitt","Kontrolle"]
[null,"X",{"$f":"I7-C7","v":0},null,{"$f":"I7-E7","v":0},null,{"$f":"I7-G7","v":0},null,{"$f":"C14*D15+E14*F15+G14*H15","v":0},{"$f":"I14","v":0}]
[null,"Y",{"$f":"I8-C8","v":0},{"$f":"D8","v":93.75},{"$f":"I8-E8","v":0},{"$f":"F8","v":8.4},{"$f":"I8-G8","v":0},{"$f":"G18*'Gamma-Verfahren_nach_DIN1052'!F51/10^6","v":0},{"$f":"C15*D15+E15*F15+G15*H15","v":0},{"$f":"I15","v":0}]
[null,"Z",{"$f":"I9-C9","v":10.690161527165927},null,{"$f":"I9-E9","v":-119.30983847283407},null,{"$f":"I9-G9","v":-219.30983847283409},null,{"$f":"C16*D15+E16*F15+G16*H15","v":-5.6843418860808015E-13},{"$f":"I16","v":-5.6843418860808015E-13}]
[]
[]
[]
[]
{"$rows_left_out":8}
{"sheet":"Verbindungsmittel","index":6,"n_rows":31,"n_cols":7,"rows_kept":31,"cut":false,"hidden":true,"merged":[]}
[]
[]
[]
[null,null,"Verbindungsmittel ","Kser (QS1/2) [Nmm]","Kser (QS2/3) [Nmm]","K1/3 (Holz-Holz)","K1/3 (Holz-Stahl)"]
[null,null,"Stabdübel",{"$f":"(('Gamma-Verfahren_nach_DIN1052'!G32)^1.5)*(('Gamma-Verfahren_nach_DIN1052'!J32))/23","v":7463.2751671687993},{"$f":"(('Gamma-Verfahren_nach_DIN1052'!H32)^1.5)*(('Gamma-Verfahren_nach_DIN1052'!K32))/23","v":1514.0175139177566},{"$f":"2/3*D5","v":4975.5167781125328},{"$f":"2*F5","v":9951.0335562250657}]
[null,null,"Passbolzen",{"$f":"(('Gamma-Verfahren_nach_DIN1052'!G32)^1.5)*(('Gamma-Verfahren_nach_DIN1052'!J32))/23","v":7463.2751671687993},{"$f":"(('Gamma-Verfahren_nach_DIN1052'!H32)^1.5)*(('Gamma-Verfahren_nach_DIN1052'!K32))/23","v":1514.0175139177566},{"$f":"2/3*D5","v":4975.5167781125328},{"$f":"2*F5","v":9951.0335562250657}]
[null,null,"Bolzen",{"$f":"(('Gamma-Verfahren_nach_DIN1052'!G32)^1.5)*(('Gamma-Verfahren_nach_DIN1052'!J32))/23","v":7463.2751671687993},{"$f":"(('Gamma-Verfahren_nach_DIN1052'!H32)^1.5)*(('Gamma-Verfahren_nach_DIN1052'!K32))/23","v":1514.0175139177566},{"$f":"2/3*D5","v":4975.5167781125328},{"$f":"2*F5","v":9951.0335562250657}]
[null,null,"Gewindestangen",{"$f":"(('Gamma-Verfahren_nach_DIN1052'!G32)^1.5)*(('Gamma-Verfahren_nach_DIN1052'!J32))/23","v":7463.2751671687993},{"$f":"(('Gamma-Verfahren_nach_DIN1052'!H32)^1.5)*(('Gamma-Verfahren_nach_DIN1052'!K32))/23","v":1514.0175139177566},{"$f":"2/3*D5","v":4975.5167781125328},{"$f":"2*F5","v":9951.0335562250657}]
[null,null,"Schrauben (vorgebohrt) ",{"$f":"(('Gamma-Verfahren_nach_DIN1052'!G32)^1.5)*(('Gamma-Verfahren_nach_DIN1052'!J32))/23","v":7463.2751671687993},{"$f":"(('Gamma-Verfahren_nach_DIN1052'!H32)^1.5)*(('Gamma-Verfahren_nach_DIN1052'!K32))/23","v":1514.0175139177566},{"$f":"2/3*D5","v":4975.5167781125328},{"$f":"2*F5","v":9951.0335562250657}]
[null,null,"Nägel (vorgebohrt) ",{"$f":"(('Gamma-Verfahren_nach_DIN1052'!G32)^1.5)*(('Gamma-Verfahren_nach_DIN1052'!J32))/23","v":7463.2751671687993},{"$f":"(('Gamma-Verfahren_nach_DIN1052'!H32)^1.5)*(('Gamma-Verfahren_nach_DIN1052'!K32))/23","v":1514.0175139177566},{"$f":"2/3*D5","v":4975.5167781125328},{"$f":"2*F5","v":9951.0335562250657}]
[null,null,"Nägel (nicht vorgebohrt) ",{"$f":"(('Gamma-Verfahren_nach_DIN1052'!G32)^1.5)*(('Gamma-Verfahren_nach_DIN1052'!J32)^0.8)/30","v":3998.5799626152375},{"$f":"(('Gamma-Verfahren_nach_DIN1052'!H32)^1.5)*(('Gamma-Verfahren_nach_DIN1052'!K32)^0.8)/30","v":841.28564681358012},{"$f":"2/3*D11","v":2665.719975076825},{"$f":"2*F11","v":5331.43995015365}]
[null,null,"Klammern ",{"$f":"(('Gamma-Verfahren_nach_DIN1052'!G32)^1.5)*(('Gamma-Verfahren_nach_DIN1052'!J32)^0.8)/80","v":1499.4674859807142},{"$f":"(('Gamma-Verfahren_nach_DIN1052'!H32)^1.5)*(('Gamma-Verfahren_nach_DIN1052'!K32)^0.8)/80","v":315.48211755509254},999.64499065380937,1999.2899813076187]
[null,null,"Ringdübel Typ A",{"$f":"(('Gamma-Verfahren_nach_DIN1052'!G32))*(('Gamma-Verfahren_nach_DIN1052'!J32))/2","v":2806.243040080456},{"$f":"(('Gamma-Verfahren_nach_DIN1052'!H32))*(('Gamma-Verfahren_nach_DIN1052'!K32))/2","v":911.72912644052349},1870.8286933869706,3741.6573867739412]
[null,null,"Scheibendübel Typ B ",{"$f":"(('Gamma-Verfahren_nach_DIN1052'!G32))*(('Gamma-Verfahren_nach_DIN1052'!J32))/2","v":2806.243040080456},{"$f":"(('Gamma-Verfahren_nach_DIN1052'!H32))*(('Gamma-Verfahren_nach_DIN1052'!K32))/2","v":911.72912644052349},1870.8286933869706,3741.6573867739412]
[null,null,"Scheibendübel Typ C1 bis C9",{"$f":"(1.5*('Gamma-Verfahren_nach_DIN1052'!G32))*(('Gamma-Verfahren_nach_DIN1052'!J32))/4","v":2104.6822800603422},{"$f":"(1.5*('Gamma-Verfahren_nach_DIN1052'!H32))*(('Gamma-Verfahren_nach_DIN1052'!K32))/4","v":683.7968448303925},1403.121520040228,2806.243040080456]
[null,null,"Scheibendübel Typ C10, C11",{"$f":"(('Gamma-Verfahren_nach_DIN1052'!G32))*(('Gamma-Verfahren_nach_DIN1052'!J32))/2","v":2806.243040080456},{"$f":"(('Gamma-Verfahren_nach_DIN1052'!H32))*(('Gamma-Verfahren_nach_DIN1052'!K32))/2","v":911.72912644052349},1870.8286933869706,3741.6573867739412]
[null,null,"Andere ",{"$f":"'Gamma-Verfahren_nach_DIN1052'!J37","v":15000},{"$f":"'Gamma-Verfahren_nach_DIN1052'!K37","v":0},{"$f":"2/3*D17","v":10000},{"$f":"2*F17","v":20000}]
[]
[]
[]
{"$rows_left_out":12}
{"sheet":"Kombinationsbeiwerte_Ψ","index":7,"n_rows":31,"n_cols":11,"rows_kept":31,"cut":false,"hidden":true,"merged":[]}
[]
[null,"veränderliche Einwirkung","Ψ0","Ψ1","Ψ2","KLED ",null,"Nutzungsklasse ","KLED","Kdef","kdef (Spanplatte)"]
[null,"Nutzlasten Qk,N",null,null,null,null,null,1,"ständig",0.6,2.25]
[null,"Kategorie A: Wohn- und Aufenthaltsräume ",0.7,0.5,0.3,"mittel",null,2,"lang",0.8,3]
[null,"Kategorie B: Büros ",0.7,0.5,0.3,"mittel",null,3,"mittel",2]
[null,"Kategorie C: Versammlungsräume ",0.7,0.7,0.6,"kurz",null,null,"kurz"]
[null,"Kategorie D: Verkaufssräume ",0.7,0.7,0.6,"mittel",null,null,"sehr kurz"]
[null,"Kategorie E: Lagerräume",1,0.9,0.8,"lang"]
[null,"Verkehrslasten Qk,V "]
[null,"Kategorie F: Verkehrsflächen, Fahrzeuglast < 25 kN  ",0.7,0.7,0.6,"mittel"]
[null,"Kategorie G: Flächen für den Betrieb miit Gegengewichtsstaplern ",0.7,0.5,0.3,"mittel"]
[null,"Kategorie H: Dächer (nicht begehbar) ",0,0,0,"kurz"]
[null,"Schnee und Eislasten Qk,S "]
[null,"Orte bis NN +1000m ",0.5,0.2,0,"kurz"]
[null,"Orte über NN +1000m ",0.7,0.5,0.2,"mittel"]
[null,"Windlasten Qk,W "]
[]
[]
[]
[]
{"$rows_left_out":12}
{"sheet":"Modifikationsbeiwert Kmod ","index":8,"n_rows":8,"n_cols":8,"rows_kept":8,"cut":false,"hidden":true,"merged":[[3,1,5,1],[6,1,7,1]]}
[]
[]
[null,"Kmod","NKL ","ständig","lang","mittel","kurz","sehr kurz"]
[null,"VH / BSH ",1,0.6,0.7,0.8,0.9,1.1000000000000001]
[null,null,2,0.6,0.7,0.8,0.9,1.1000000000000001]
[null,null,3,0.5,0.55000000000000004,0.65,0.7,0.9]
[null,"Spannplatten",1,0.3,0.45,0.65,0.85,1.1000000000000001]
[null,null,2,0.2,0.3,0.45,0.6,0.8]

{"sheet":"Werkstoffkenngrößen","index":9,"n_rows":42,"n_cols":10,"rows_kept":42,"cut":false,"hidden":true,"merged":[[33,1,41,1],[1,6,1,9],[26,1,32,1],[4,1,8,1],[9,1,12,1],[13,1,20,1],[21,1,25,1]]}
[]
[null,null,null,null,null,null,"Festigkeitskennwerte"]
[null,null,null,null,null,null,"Zug","Druck","Biegung","Schub/Torsion"]
[null,"Holzeigenschaften","Holzart","E0,mean [N/mm²]","rk [Kg/m³]","Einbaufeuchte","ft,0,k [N/mm²]","fc,0,k [N/mm²]","fm,y,k [N/mm²]","fv,k [N/mm²]"]
[null,"Nadelholz","C16",8000,310,"<30%"]
[null,null,"C24",11000,350,"≥30%",14.5,21,24,4]
[null,null,"C30",12000,380,null,19,24,30,4]
[null,null,"C35",13000,400,null,22.5,25,35,4]
[null,null,"C40",14000,420,null,26,27,40,4]
[null,"Laubholz","D30",11000,530,null,18,24,30,3.9]
[null,null,"D35",12000,540,null,21,25,35,4.0999999999999996]
[null,null,"D40",13000,550,null,24,27,40,4.2]
[null,null,"D60",17000,700,null,26,33,60,4.8]
[null,"BSH ","GL24c",11000,365,null,17,21.5,24,3.5]
[null,null,"GL24h",11500,385,null,19.2,24,24,3.5]
[null,null,"GL28c",12500,390,null,19.5,24,28,3.5]
[null,null,"GL28h",12600,425,null,22.3,28,28,3.5]
[null,null,"GL30c",13000,390,null,19.5,24.5,30,3.5]
[null,null,"GL30h",13600,430,null,24,30,30,3.5]
[null,null,"GL32c",13500,400,null,19.5,24.5,32,3.5]
{"$rows_left_out":23}
{"sheet":"Statisches_System","index":10,"n_rows":13,"n_cols":6,"rows_kept":13,"cut":false,"hidden":true,"merged":[]}
[]
[]
[]
[null,null,"Tragsystem","Abstand M=0-Punkte","Durchbiegung w"]
[null,null,"Einfeldträger",{"$f":"'Gamma-Verfahren_nach_DIN1052'!$D$13","v":6},{"$f":"('Gamma-Verfahren_nach_DIN1052'!G10*('Gamma-Verfahren_nach_DIN1052'!D13:E13)^4)/(76.8*'Gamma-Verfahren_nach_DIN1052'!E167)","v":{"$error":"#DIV/0!"}},{"$error":"#DIV/0!"}]
[null,null,"Durchlaufträger",{"$f":"0.8*'Gamma-Verfahren_nach_DIN1052'!$D$13","v":4.8000000000000007}]
[null,null,"Kragarm",{"$f":"2*'Gamma-Verfahren_nach_DIN1052'!$D$13","v":12}]
[]
[]
[null,null,"Anzahl Querschnitte","Querschnittstypen"]
[null,null,1,"A"]
[null,null,2,"B"]
[null,null,3,"C"]